Compare commits

...
14 changed files with 243 additions and 29 deletions
+45
View File
@@ -0,0 +1,45 @@
name: Linux Build and Test
on: [push]
jobs:
gcc:
runs-on: ubuntu-latest
strategy:
matrix:
symbols:
- "no"
- "mem"
- "all"
defaults:
run:
shell: bash
working-directory: unix
steps:
- name: Checkout
uses: actions/checkout@v2
- name: Configure (symbols=${{ matrix.symbols }})
run: |
mkdir "${HOME}/install dir"
./configure ${CFGOPT} "--prefix=$HOME/install dir" || (cat config.log && exit 1)
env:
CFGOPT: --enable-symbols=${{ matrix.symbols }}
- name: Prepare
run: touch tclStubInit.c tclOOStubInit.c
working-directory: generic
- name: Build
run: |
make all
- name: Build Test Harness
run: |
make tcltest
- name: Run Tests
run: |
make test
- name: Test-Drive Installation
run: |
make install
- name: Create Distribution Package
run: |
make dist
- name: Convert Documentation to HTML
run: |
make html-tcl
+61
View File
@@ -0,0 +1,61 @@
name: macOS Build and Test
on: [push]
jobs:
with-Xcode:
runs-on: macos-latest
defaults:
run:
shell: bash
working-directory: macosx
steps:
- name: Checkout
uses: actions/checkout@v2
- name: Prepare
run: touch tclStubInit.c tclOOStubInit.c
working-directory: generic
- name: Build
run: make all
- name: Run Tests
run: make test styles=develop
env:
ERROR_ON_FAILURES: 1
MAC_CI: 1
Unix-like:
runs-on: macos-latest
strategy:
matrix:
symbols:
- "no"
- "mem"
dtrace:
- "no"
- "yes"
defaults:
run:
shell: bash
working-directory: unix
steps:
- name: Checkout
uses: actions/checkout@v2
- name: Prepare
run: |
touch tclStubInit.c tclOOStubInit.c
mkdir "$HOME/install dir"
working-directory: generic
- name: Configure (symbols=${{ matrix.symbols }} dtrace=${{ matrix.dtrace }})
# Note that macOS is always a 64 bit platform
run: ./configure --enable-64bit ${CFGOPT} "--prefix=$HOME/install dir" || (cat config.log && exit 1)
env:
CFGOPT: --enable-symbols=${{ matrix.symbols }} --enable-dtrace=${{ matrix.dtrace }}
- name: Build
run: |
make all tcltest
- name: Run Tests
run: |
make test
env:
ERROR_ON_FAILURES: 1
MAC_CI: 1
- name: Trial Installation
run: |
make install
+71
View File
@@ -0,0 +1,71 @@
name: Windows Build and Test
on: [push]
jobs:
MSVC:
runs-on: windows-latest
defaults:
run:
shell: powershell
working-directory: win
# Using powershell means we need to explicitly stop on failure
steps:
- name: Checkout
uses: actions/checkout@v2
- name: Init MSVC
uses: ilammy/msvc-dev-cmd@v1
- name: Build
run: |
&nmake -f makefile.vc all
if ($lastexitcode -ne 0) {
throw "nmake exit code: $lastexitcode"
}
- name: Build Test Harness
run: |
&nmake -f makefile.vc tcltest
if ($lastexitcode -ne 0) {
throw "nmake exit code: $lastexitcode"
}
- name: Run Tests
run: |
&nmake -f makefile.vc test
if ($lastexitcode -ne 0) {
throw "nmake exit code: $lastexitcode"
}
env:
ERROR_ON_FAILURES: 1
MSYS-gcc:
runs-on: windows-latest
defaults:
run:
shell: bash
working-directory: win
strategy:
matrix:
symbols:
- "no"
- "mem"
- "all"
# Using powershell means we need to explicitly stop on failure
steps:
- name: Checkout
uses: actions/checkout@v2
- name: Install MSYS2 and Make
run: choco install msys2 make
- name: Prepare
run: |
touch tclStubInit.c tclOOStubInit.c
mkdir "${HOME}/install dir"
working-directory: generic
- name: Configure (symbols=${{ matrix.symbols }})
run: |
./configure ${CFGOPT} "--prefix=$HOME/install dir" || (cat config.log && exit 1)
env:
CFGOPT: --enable-64bit --enable-symbols=${{ matrix.symbols }}
- name: Build
run: make all
- name: Build Test Harness
run: make tcltest
- name: Run Tests
run: make test
env:
ERROR_ON_FAILURES: 1
+14 -1
View File
@@ -5,7 +5,20 @@ This is the **Tcl 8.6.10** source distribution.
You can get any source release of Tcl from [our distribution
site](https://sourceforge.net/projects/tcl/files/Tcl/).
[![Build Status](https://travis-ci.org/tcltk/tcl.svg?branch=core-8-6-branch)](https://travis-ci.org/tcltk/tcl)
8.6.10
[![Build Status](https://github.com/tcltk/tcl/workflows/Linux%20Build%20and%20Test/badge.svg?branch=core-8-6-branch)](https://github.com/tcltk/tcl/actions?query=workflow%3A%22Linux+Build+and+Test%22+branch%3Acore-8-6-branch)
[![Build Status](https://github.com/tcltk/tcl/workflows/Windows%20Build%20and%20Test/badge.svg?branch=core-8-6-branch)](https://github.com/tcltk/tcl/actions?query=workflow%3A%22Windows+Build+and+Test%22+branch%3Acore-8-6-branch)
[![Build Status](https://github.com/tcltk/tcl/workflows/macOS%20Build%20and%20Test/badge.svg?branch=core-8-6-branch)](https://github.com/tcltk/tcl/actions?query=workflow%3A%22macOS+Build+and+Test%22+branch%3Acore-8-6-branch)
<br>
8.7a4
[![Build Status](https://github.com/tcltk/tcl/workflows/Linux%20Build%20and%20Test/badge.svg?branch=core-8-branch)](https://github.com/tcltk/tcl/actions?query=workflow%3A%22Linux+Build+and+Test%22+branch%3Acore-8-branch)
[![Build Status](https://github.com/tcltk/tcl/workflows/Windows%20Build%20and%20Test/badge.svg?branch=core-8-branch)](https://github.com/tcltk/tcl/actions?query=workflow%3A%22Windows+Build+and+Test%22+branch%3Acore-8-branch)
[![Build Status](https://github.com/tcltk/tcl/workflows/macOS%20Build%20and%20Test/badge.svg?branch=core-8-branch)](https://github.com/tcltk/tcl/actions?query=workflow%3A%22macOS+Build+and+Test%22+branch%3Acore-8-branch)
<br>
9.0a2
[![Build Status](https://github.com/tcltk/tcl/workflows/Linux%20Build%20and%20Test/badge.svg?branch=main)](https://github.com/tcltk/tcl/actions?query=workflow%3A%22Linux+Build+and+Test%22+branch%3Amain)
[![Build Status](https://github.com/tcltk/tcl/workflows/Windows%20Build%20and%20Test/badge.svg?branch=main)](https://github.com/tcltk/tcl/actions?query=workflow%3A%22Windows+Build+and+Test%22+branch%3Amain)
[![Build Status](https://github.com/tcltk/tcl/workflows/macOS%20Build%20and%20Test/badge.svg?branch=main)](https://github.com/tcltk/tcl/actions?query=workflow%3A%22macOS+Build+and+Test%22+branch%3Amain)
## Contents
1. [Introduction](#intro)
+2 -2
View File
@@ -21,7 +21,7 @@ catch [list package require -exact Tcltest [info patchlevel]]
testConstraint testasync [llength [info commands testasync]]
testConstraint threaded [::tcl::pkgconfig get threaded]
testConstraint knownMsvcBug [expr {![info exists ::env(TRAVIS_OS_NAME)] || ![string match windows $::env(TRAVIS_OS_NAME)]}]
testConstraint notWinCI [expr {$::tcl_platform(platform) != "windows" || ![info exists ::env(CI)]}]
proc async1 {result code} {
global aresult acode
@@ -204,7 +204,7 @@ test async-4.2 {async interrupting straight bytecode sequence} -constraints {
testasync delete $hm
}
test async-4.3 {async interrupting loop-less bytecode sequence} -constraints {
testasync threaded knownMsvcBug
testasync threaded notWinCI
} -setup {
set hm [testasync create async3]
} -body {
+4 -3
View File
@@ -42,7 +42,8 @@ namespace eval ::tcl::test::io {
testConstraint testchannelevent [llength [info commands testchannelevent]]
testConstraint testmainthread [llength [info commands testmainthread]]
testConstraint testservicemode [llength [info commands testservicemode]]
testConstraint knownMsvcBug [expr {![info exists ::env(TRAVIS_OS_NAME)] || ![string match windows $::env(TRAVIS_OS_NAME)]}]
testConstraint notWinCI [expr {
$::tcl_platform(platform) ne "windows" || ![info exists ::env(CI)]}]
testConstraint notOSX [expr {$::tcl_platform(os) ne "Darwin"}]
# You need a *very* special environment to do some tests. In particular,
@@ -1881,7 +1882,7 @@ test chan-io-20.3 {Tcl_CreateChannel: initial settings} -constraints {unix} -bod
} -result {{{} {}} {auto lf}}
test chan-io-20.5 {Tcl_CreateChannel: install channel in empty slot} -setup {
set path(stdout) [makeFile {} stdout]
} -constraints {stdio knownMsvcBug} -body {
} -constraints {stdio notWinCI} -body {
set f [open $path(script) w]
chan puts -nonewline $f {
chan close stdout
@@ -2791,7 +2792,7 @@ test chan-io-29.34 {Tcl_Chan Close, async flush on chan close, using sockets} -s
chan puts $s $l
}
}
} -constraints {socket tempNotMac fileevent knownMsvcBug} -body {
} -constraints {socket tempNotMac fileevent notWinCI} -body {
proc accept {s a p} {
variable x
chan event $s readable [namespace code [list readit $s]]
+5 -2
View File
@@ -24,7 +24,8 @@ package require tcltests
# All tests require the "exec" command.
# Skip them if exec is not defined.
testConstraint exec [llength [info commands exec]]
testConstraint noosx [expr {![info exists ::env(TRAVIS_OSX_IMAGE)] || ![string match xcode* $::env(TRAVIS_OSX_IMAGE)]}]
# Some skips when running in a macOS CI environment
testConstraint noosxCI [expr {![info exists ::env(MAC_CI)]}]
unset -nocomplain path
@@ -671,7 +672,9 @@ test exec-18.2 {exec cat deals with weird file names} -body {
# Note that this test cannot be adapted to work on Windows; that platform has
# no kernel support for an analog of O_APPEND. OTOH, that means we can assume
# that there is a POSIX shell...
test exec-19.1 {exec >> uses O_APPEND} -constraints {exec unix notValgrind noosx} -setup {
#
# This test also fails in some cases when building with macOS
test exec-19.1 {exec >> uses O_APPEND} -constraints {exec unix notValgrind noosxCI} -setup {
set tmpfile [makeFile {0} tmpfile.exec-19.1]
} -body {
# Note that we have to allow for the current contents of the temporary
+6 -1
View File
@@ -80,6 +80,7 @@ testConstraint darwin9 [expr {
&& [package vsatisfies 1.$::tcl_platform(osVersion) 1.9]
}]
testConstraint notDarwin9 [expr {![testConstraint darwin9]}]
testConstraint notContinuousIntegration [expr {![info exists ::env(CI)]}]
testConstraint fileSharing 0
testConstraint notFileSharing 1
@@ -2582,7 +2583,11 @@ test fCmd-30.2 {file readable on 'NTUSER.DAT'} -constraints {win} -body {
&& [file exists $env(USERPROFILE)/NTUSER.DAT]
&& [file readable $env(USERPROFILE)/NTUSER.DAT]}
} -result {1}
test fCmd-30.3 {file readable on 'pagefile.sys'} -constraints {win} -body {
# At least one CI environment (GitHub Actions) is set up with the page file in
# an unusual location; skip the test if that is so.
test fCmd-30.3 {file readable on 'pagefile.sys'} -constraints {
win notContinuousIntegration
} -body {
set r {}
if {[info exists env(SystemDrive)]} {
set path $env(SystemDrive)/pagefile.sys
+4 -2
View File
@@ -38,7 +38,9 @@ catch {
testConstraint testfilesystem [llength [info commands ::testfilesystem]]
testConstraint testsetplatform [llength [info commands ::testsetplatform]]
testConstraint testsimplefilesystem [llength [info commands ::testsimplefilesystem]]
testConstraint knownMsvcBug [expr {![info exists ::env(TRAVIS_OS_NAME)] || ![string match windows $::env(TRAVIS_OS_NAME)]}]
# Some things fail under all Continuous Integration systems for subtle reasons
# such as CI often running with elevated privileges in a container.
testConstraint notInCIenv [expr {![info exists ::env(CI)]}]
cd [tcltest::temporaryDirectory]
makeFile "test file" gorp.file
@@ -317,7 +319,7 @@ test filesystem-1.37 {file normalisation with '/./'} -body {
} -match regexp -result {^(?:[^/]|/(?:[^/]|$))+$}
test filesystem-1.38 {file normalisation with volume relative} -setup {
set dir [pwd]
} -constraints {win moreThanOneDrive knownMsvcBug} -body {
} -constraints {win moreThanOneDrive notInCIenv} -body {
set path "[string range [lindex $drives 0] 0 1]foo"
cd [lindex $drives 1]
file norm $path
+9 -5
View File
@@ -18,10 +18,14 @@ if {"::tcltest" ni [namespace children]} {
# %u output depends on word length, so this test is not portable.
testConstraint longIs32bit [expr {int(0x80000000) < 0}]
testConstraint longIs64bit [expr {int(0x8000000000000000) < 0}]
testConstraint wideIs64bit \
[expr {(wide(0x80000000) > 0) && (wide(0x8000000000000000) < 0)}]
testConstraint wideIs64bit [expr {
(wide(0x80000000) > 0) && (wide(0x8000000000000000) < 0)}]
testConstraint wideBiggerThanInt [expr {wide(0x80000000) != int(0x80000000)}]
testConstraint knownMsvcBug [expr {![info exists ::env(TRAVIS_OS_NAME)] || ![string match windows $::env(TRAVIS_OS_NAME)]}]
# MSVC uses a broken libc that gets sprintf("%g") wrong. This is a pain
# particularly in Continuous Integration, and there isn't anything much we can
# do about it.
testConstraint notWinCI [expr {
($::tcl_platform(platform) ne "windows") || ![info exists ::env(CI)]}]
test format-1.1 {integer formatting} {
format "%*d %d %d %d" 6 34 16923 -12 -1
@@ -274,13 +278,13 @@ test format-6.1 {floating-point zeroes} {eformat} {
test format-6.2 {floating-point zeroes} {eformat} {
format "%.4e %.4f %.4g" 0.0 0.0 0.0 0.0
} {0.0000e+00 0.0000 0}
test format-6.3 {floating-point zeroes} {eformat knownMsvcBug} {
test format-6.3 {floating-point zeroes} {eformat notWinCI} {
format "%#.4e %#.4f %#.4g" 0.0 0.0 0.0 0.0
} {0.0000e+00 0.0000 0.000}
test format-6.4 {floating-point zeroes} {eformat} {
format "%.0e %.0f %.0g" 0.0 0.0 0.0 0.0
} {0e+00 0 0}
test format-6.5 {floating-point zeroes} {eformat knownMsvcBug} {
test format-6.5 {floating-point zeroes} {eformat notWinCI} {
format "%#.0e %#.0f %#.0g" 0.0 0.0 0.0 0.0
} {0.e+00 0. 0.}
test format-6.6 {floating-point zeroes} {
+7 -4
View File
@@ -43,7 +43,10 @@ testConstraint testchannelevent [llength [info commands testchannelevent]]
testConstraint testmainthread [llength [info commands testmainthread]]
testConstraint testobj [llength [info commands testobj]]
testConstraint testservicemode [llength [info commands testservicemode]]
testConstraint knownMsvcBug [expr {![info exists ::env(TRAVIS_OS_NAME)] || ![string match windows $::env(TRAVIS_OS_NAME)]}]
# Some things fail under Windows in Continuous Integration systems for subtle
# reasons such as CI often running with elevated privileges in a container.
testConstraint notWinCI [expr {
$::tcl_platform(platform) ne "windows" || ![info exists ::env(CI)]}]
testConstraint notOSX [expr {$::tcl_platform(os) ne "Darwin"}]
# You need a *very* special environment to do some tests. In
@@ -2230,7 +2233,7 @@ test io-27.5 {FlushChannel, implicit flush when buffer fills and on close} \
set path(pipe) [makeFile {} pipe]
set path(output) [makeFile {} output]
test io-27.6 {FlushChannel, async flushing, async close} \
{stdio asyncPipeClose knownMsvcBug} {
{stdio asyncPipeClose notWinCI} {
# This test may fail on old Unix systems (seen on IRIX64 6.5) with
# obsolete gettimeofday() calls. See Tcl Bugs 3530533, 1942197.
file delete $path(pipe)
@@ -2834,7 +2837,7 @@ test io-29.31 {Tcl_WriteChars, background flush} stdio {
set result
} ok
test io-29.32 {Tcl_WriteChars, background flush to slow reader} \
{stdio asyncPipeClose knownMsvcBug} {
{stdio asyncPipeClose notWinCI} {
# This test may fail on old Unix systems (seen on IRIX64 6.5) with
# obsolete gettimeofday() calls. See Tcl Bugs 3530533, 1942197.
file delete $path(pipe)
@@ -8068,7 +8071,7 @@ test io-53.17 {[7c187a3773] MBWrite: proper inQueueTail handling} -setup {
removeFile out
} -result {line 100 line}
test io-54.1 {Recursive channel events} {socket fileevent knownMsvcBug} {
test io-54.1 {Recursive channel events} {socket fileevent notWinCI} {
# This test checks to see if file events are delivered during recursive
# event loops when there is buffered data on the channel.
+3 -1
View File
@@ -67,7 +67,9 @@ if {"::tcltest" ni [namespace children]} {
::tcltest::loadTestedCommands
if {[info exists ::env(TRAVIS_OSX_IMAGE)] && [string match xcode* $::env(TRAVIS_OSX_IMAGE)]} {
# A bad interaction between socket creation, macOS, and unattended CI
# environments make this whole file impractical to run; too many weird hangs.
if {[info exists ::env(MAC_CI)]} {
return
}
+8 -6
View File
@@ -29,7 +29,9 @@ testConstraint testchmod [llength [info commands testchmod]]
testConstraint cdrom 0
testConstraint exdev 0
testConstraint longFileNames 0
testConstraint knownMsvcBug [expr {![info exists ::env(TRAVIS_OS_NAME)] || ![string match windows $::env(TRAVIS_OS_NAME)]}]
# Some things fail under all Continuous Integration systems for subtle reasons
# such as CI often running with elevated privileges in a container.
testConstraint notInCIenv [expr {![info exists ::env(CI)]}]
proc createfile {file {string a}} {
set f [open $file w]
@@ -411,7 +413,7 @@ proc MakeFiles {dirname} {
test winFCmd-1.38 {TclpRenameFile: check rename of conflicting inodes} -setup {
cleanup
} -constraints {win winNonZeroInodes knownMsvcBug} -body {
} -constraints {win winNonZeroInodes notInCIenv} -body {
file mkdir td1
foreach {a b} [MakeFiles td1] break
file rename -force $a $b
@@ -661,7 +663,7 @@ test winFCmd-5.1 {TclpCopyDirectory: calls TraverseWinTree} -setup {
test winFCmd-6.1 {TclpRemoveDirectory: errno: EACCES} -setup {
cleanup
} -constraints {winVista testfile testchmod knownMsvcBug} -body {
} -constraints {winVista testfile testchmod notInCIenv} -body {
file mkdir td1
testchmod 0 td1
testfile rmdir td1
@@ -715,7 +717,7 @@ test winFCmd-6.8 {TclpRemoveDirectory: RemoveDirectory fails} -setup {
} -result {1 {tf1 ENOTDIR}}
test winFCmd-6.9 {TclpRemoveDirectory: errno == EACCES} -setup {
cleanup
} -constraints {winVista testfile testchmod knownMsvcBug} -body {
} -constraints {winVista testfile testchmod notInCIenv} -body {
file mkdir td1
testchmod 0 td1
testfile rmdir td1
@@ -733,7 +735,7 @@ test winFCmd-6.11 {TclpRemoveDirectory: attr == -1} -setup {
} -returnCodes error -match regexp -result {^/ E(ACCES|EXIST)$}
test winFCmd-6.13 {TclpRemoveDirectory: write-protected} -setup {
cleanup
} -constraints {winVista testfile testchmod knownMsvcBug} -body {
} -constraints {winVista testfile testchmod notInCIenv} -body {
file mkdir td1
testchmod 0 td1
testfile rmdir td1
@@ -962,7 +964,7 @@ test winFCmd-9.1 {TraversalDelete: DOTREE_F} -setup {
} -result {}
test winFCmd-9.3 {TraversalDelete: DOTREE_PRED} -setup {
cleanup
} -constraints {winVista testfile testchmod knownMsvcBug} -body {
} -constraints {winVista testfile testchmod notInCIenv} -body {
file mkdir td1/td2
testchmod 0 td1
testfile rmdir -force td1
+4 -2
View File
@@ -19,7 +19,9 @@ if {"::tcltest" ni [namespace children]} {
catch [list package require -exact Tcltest [info patchlevel]]
testConstraint testwinclock [llength [info commands testwinclock]]
testConstraint knownMsvcBug [expr {![info exists ::env(TRAVIS_OS_NAME)] || ![string match windows $::env(TRAVIS_OS_NAME)]}]
# Some things fail under all Continuous Integration systems for subtle reasons
# such as CI often running with elevated privileges in a container.
testConstraint notInCIenv [expr {![info exists ::env(CI)]}]
# The next two tests will crash on Windows if the check for negative
# clock values is not done properly.
@@ -41,7 +43,7 @@ test winTime-1.2 {TclpGetDate} {win} {
# with the Windows clock. 30 sec really isn't enough,
# but how much time does a tester have patience for?
test winTime-2.1 {Synchronization of Tcl and Windows clocks} {testwinclock knownMsvcBug} {
test winTime-2.1 {Synchronization of Tcl and Windows clocks} {testwinclock notInCIenv} {
# May fail due to OS/hardware discrepancies. See:
# http://support.microsoft.com/default.aspx?scid=kb;en-us;274323
set failed {}